{"text_format":"1","workbook":"xlsx","n_sheets":3,"sheets":["VERİ TABANI","ANASAYFA","Sayfa1"],"not_rendered":{"charts":0,"images":3,"macros":1,"external_links":0,"defined_names":7,"comments":0,"pivot_tables":0},"unopened":[],"bounds":{"document_bytes":16777216,"sheet_cells":100000,"rows_first":2000,"rows_last":500,"rows_between":2000,"halvings":0,"cell_chars":16384,"cell_head_chars":4096},"cells_cut":0,"cells_raw":0,"read":"whole","date_system":"1900"}

{"sheet":"VERİ TABANI","index":0,"n_rows":149,"n_cols":71,"rows_kept":149,"cut":false,"hidden":false,"merged":[[0,7,1,10],[0,11,1,19],[1,68,1,70]]}
[null,null,null,null,null,null,63,"SINIF REHBER ÖĞRETMENİ DOLDURACAK",null,null,null,"BU DERSE GİREN ÖĞRETMENLER DOLDURACAK (NOT: SINIF REHBER ÖĞRETMENİNİN GİRDİĞİ DERS KISMI DA DOLDURULACAKTIR)",null,null,null,null,null,null,null,null,null,null,null,"FEN",null,null,null,null,null,null,null,null,"İNKILAP",null,null,null,null,null,null,null,"YABANCI DİL",null,null,null,null,null,null,null,"DİN KÜLTÜRÜ",null,null,null,null,null,null,null,null,57,58,59,60,61,62,63,null,null,null,null,66,67,68]
[null,null,null,null,null,null,null,null,null,null,null,null,null,null,null,null,null,null,null,null,null,null,null,null,null,null,null,null,null,null,null,null,null,null,null,null,null,null,null,null,null,null,null,null,null,null,null,null,null,null,null,null,null,null,null,null,null,null,null,null,null,null,null,null,null,null,null,null,"GENEL DENEME SINAVLARI"]
["OKUL N","ADI S.","SOYADI","SINIFI","DT","TC KİMLİK","CİLT","KİŞİLİK","SAĞLIK","SOSYAL","EKONOMİK","TÜRKÇE","MATEMATİK","FEN","SOSYAL","YABANCI DİL","DİN KÜLTÜRÜ","BEDEN EĞİTİMİ","TEKNOLOJİ VE TAS.","MÜZİK","S1","S2","1. DÖN","Y1","Y2","Y3","P1","P2","S1","S2",null,"1. DÖN","Y1","Y2","Y3","P1","P2","S1","S2","1. DÖN","Y1","Y2","Y3","P1","P2","S1","S2","1. DÖN","Y1","Y2","Y3","P1","P2","S1","S2","1. DÖN","OKUL N","İLİ","İLÇESİ","4. SINIF ORT.","5. SINIF ORT.","6. SINIF ORT.","7. SINIF ORT.","FOTOS","SIRA NO","ANNE ADI","BABA ADI","SINIFI","OKUL DENEME\n1\n31 EKİM 2017","OKUL DENEME\n2\n28 KASIM\n2017","OKUL DENEME\n3\n26 ARALK \n2017"]
[605,"FALAN","FİLAN","5A","RİZE    29/11/2007",10403944634,"147","Davranış, terbiye ve saygı bakımından olumlu bir öğrencidir. Güvenilir bir öğrencidir. ","Herhangi bir sağlık problemi bulunmamaktadır","Aktif, dürüst,  güvenilir, iyi huylu, konuşkan birisidir","ekonomik durumu iyidir","Derste çok istekli ve gayretli bir öğrenci","zeki, dikkat dağınıklığı var belirli bir süre odaklanamıyor","derslere katılımı güzeldir.","Derse aktif olarak katılmaya çalışıyor istekli fakat bazen sadece cevap vermek için derse katılıyor. ","derse ilgili aktif başarılı","Derse katılımı normaldir. ","dersi ve ders dışında hareketli bir öğrencim hareket becerilerinde orta seviye üstü ","Harika bir öğrenci. Davranışlarını beğeniyorum","Rahat, kendine güvenen ,haylazlığa meyilli bir öğrenci .Derslere katılımı çok başarılı değil  ama istekli.",null,null,null,null,null,null,null,null,null,null,null,null,null,null,null,null,null,null,null,null,null,null,null,null,null,null,null,null,null,null,null,null,null,null,null,null,605,"ORDU","ÜNYE",78.090600000000009,85,90,98,null,"41","FALAN ANNE","FİLAN BABA","5A"]
[null,null,null,null,null,null,null,null,null,null,null,null,null,null,null,null,null,null,null,null,null,null,null,null,null,null,null,null,null,null,null,null,null,null,null,null,null,null,null,null,null,null,null,null,null,null,null,null,null,null,null,null,null,null,null,null,null,null,null,null,null,null,null,null,null,null,null,"5A"]
[null,null,null,null,null,null,null,null,null,null,null,null,null,null,null,null,null,null,null,null,null,null,null,null,null,null,null,null,null,null,null,null,null,null,null,null,null,null,null,null,null,null,null,null,null,null,null,null,null,null,null,null,null,null,null,null,null,null,null,null,null,null,null,null,null,null,null,"5A"]
[null,null,null,null,null,null,null,null,null,null,null,null,null,null,null,null,null,null,null,null,null,null,null,null,null,null,null,null,null,null,null,null,null,null,null,null,null,null,null,null,null,null,null,null,null,null,null,null,null,null,null,null,null,null,null,null,null,null,null,null,null,null,null,null,null,null,null,"5A"]
[null,null,null,null,null,null,null,null,null,null,null,null,null,null,null,null,null,null,null,null,null,null,null,null,null,null,null,null,null,null,null,null,null,null,null,null,null,null,null,null,null,null,null,null,null,null,null,null,null,null,null,null,null,null,null,null,null,null,null,null,null,null,null,null,null,null,null,"5A"]
[null,null,null,null,null,null,null,null,null,null,null,null,null,null,null,null,null,null,null,null,null,null,null,null,null,null,null,null,null,null,null,null,null,null,null,null,null,null,null,null,null,null,null,null,null,null,null,null,null,null,null,null,null,null,null,null,null,null,null,null,null,null,null,null,null,null,null,"5A"]
[null,null,null,null,null,null,null,null,null,null,null,null,null,null,null,null,null,null,null,null,null,null,null,null,null,null,null,null,null,null,null,null,null,null,null,null,null,null,null,null,null,null,null,null,null,null,null,null,null,null,null,null,null,null,null,null,null,null,null,null,null,null,null,null,null,null,null,"5A"]
[null,null,null,null,null,null,null,null,null,null,null,null,null,null,null,null,null,null,null,null,null,null,null,null,null,null,null,null,null,null,null,null,null,null,null,null,null,null,null,null,null,null,null,null,null,null,null,null,null,null,null,null,null,null,null,null,null,null,null,null,null,null,null,null,null,null,null,"5A"]
[null,null,null,null,null,null,null,null,null,null,null,null,null,null,null,null,null,null,null,null,null,null,null,null,null,null,null,null,null,null,null,null,null,null,null,null,null,null,null,null,null,null,null,null,null,null,null,null,null,null,null,null,null,null,null,null,null,null,null,null,null,null,null,null,null,null,null,"5A"]
[null,null,null,null,null,null,null,null,null,null,null,null,null,null,null,null,null,null,null,null,null,null,null,null,null,null,null,null,null,null,null,null,null,null,null,null,null,null,null,null,null,null,null,null,null,null,null,null,null,null,null,null,null,null,null,null,null,null,null,null,null,null,null,null,null,null,null,"5A"]
[null,null,null,null,null,null,null,null,null,null,null,null,null,null,null,null,null,null,null,null,null,null,null,null,null,null,null,null,null,null,null,null,null,null,null,null,null,null,null,null,null,null,null,null,null,null,null,null,null,null,null,null,null,null,null,null,null,null,null,null,null,null,null,null,null,null,null,"5A"]
[null,null,null,null,null,null,null,null,null,null,null,null,null,null,null,null,null,null,null,null,null,null,null,null,null,null,null,null,null,null,null,null,null,null,null,null,null,null,null,null,null,null,null,null,null,null,null,null,null,null,null,null,null,null,null,null,null,null,null,null,null,null,null,null,null,null,null,"5A"]
[null,null,null,null,null,null,null,null,null,null,null,null,null,null,null,null,null,null,null,null,null,null,null,null,null,null,null,null,null,null,null,null,null,null,null,null,null,null,null,null,null,null,null,null,null,null,null,null,null,null,null,null,null,null,null,null,null,null,null,null,null,null,null,null,null,null,null,"5A"]
[null,null,null,null,null,null,null,null,null,null,null,null,null,null,null,null,null,null,null,null,null,null,null,null,null,null,null,null,null,null,null,null,null,null,null,null,null,null,null,null,null,null,null,null,null,null,null,null,null,null,null,null,null,null,null,null,null,null,null,null,null,null,null,null,null,null,null,"5A"]
[null,null,null,null,null,null,null,null,null,null,null,null,null,null,null,null,null,null,null,null,null,null,null,null,null,null,null,null,null,null,null,null,null,null,null,null,null,null,null,null,null,null,null,null,null,null,null,null,null,null,null,null,null,null,null,null,null,null,null,null,null,null,null,null,null,null,null,"5A"]
[null,null,null,null,null,null,null,null,null,null,null,null,null,null,null,null,null,null,null,null,null,null,null,null,null,null,null,null,null,null,null,null,null,null,null,null,null,null,null,null,null,null,null,null,null,null,null,null,null,null,null,null,null,null,null,null,null,null,null,null,null,null,null,null,null,null,null,"5B"]
[null,null,null,null,null,null,null,null,null,null,null,null,null,null,null,null,null,null,null,null,null,null,null,null,null,null,null,null,null,null,null,null,null,null,null,null,null,null,null,null,null,null,null,null,null,null,null,null,null,null,null,null,null,null,null,null,null,null,null,null,null,null,null,null,null,null,null,"5B"]
[null,null,null,null,null,null,null,null,null,null,null,null,null,null,null,null,null,null,null,null,null,null,null,null,null,null,null,null,null,null,null,null,null,null,null,null,null,null,null,null,null,null,null,null,null,null,null,null,null,null,null,null,null,null,null,null,null,null,null,null,null,null,null,null,null,null,null,"5B"]
[null,null,null,null,null,null,null,null,null,null,null,null,null,null,null,null,null,null,null,null,null,null,null,null,null,null,null,null,null,null,null,null,null,null,null,null,null,null,null,null,null,null,null,null,null,null,null,null,null,null,null,null,null,null,null,null,null,null,null,null,null,null,null,null,null,null,null,"5B"]
[null,null,null,null,null,null,null,null,null,null,null,null,null,null,null,null,null,null,null,null,null,null,null,null,null,null,null,null,null,null,null,null,null,null,null,null,null,null,null,null,null,null,null,null,null,null,null,null,null,null,null,null,null,null,null,null,null,null,null,null,null,null,null,null,null,null,null,"5B"]
[null,null,null,null,null,null,null,null,null,null,null,null,null,null,null,null,null,null,null,null,null,null,null,null,null,null,null,null,null,null,null,null,null,null,null,null,null,null,null,null,null,null,null,null,null,null,null,null,null,null,null,null,null,null,null,null,null,null,null,null,null,null,null,null,null,null,null,"5B"]
[null,null,null,null,null,null,null,null,null,null,null,null,null,null,null,null,null,null,null,null,null,null,null,null,null,null,null,null,null,null,null,null,null,null,null,null,null,null,null,null,null,null,null,null,null,null,null,null,null,null,null,null,null,null,null,null,null,null,null,null,null,null,null,null,null,null,null,"5B"]
[null,null,null,null,null,null,null,null,null,null,null,null,null,null,null,null,null,null,null,null,null,null,null,null,null,null,null,null,null,null,null,null,null,null,null,null,null,null,null,null,null,null,null,null,null,null,null,null,null,null,null,null,null,null,null,null,null,null,null,null,null,null,null,null,null,null,null,"5B"]
[null,null,null,null,null,null,null,null,null,null,null,null,null,null,null,null,null,null,null,null,null,null,null,null,null,null,null,null,null,null,null,null,null,null,null,null,null,null,null,null,null,null,null,null,null,null,null,null,null,null,null,null,null,null,null,null,null,null,null,null,null,null,null,null,null,null,null,"5B"]
[null,null,null,null,null,null,null,null,null,null,null,null,null,null,null,null,null,null,null,null,null,null,null,null,null,null,null,null,null,null,null,null,null,null,null,null,null,null,null,null,null,null,null,null,null,null,null,null,null,null,null,null,null,null,null,null,null,null,null,null,null,null,null,null,null,null,null,"5B"]
[null,null,null,null,null,null,null,null,null,null,null,null,null,null,null,null,null,null,null,null,null,null,null,null,null,null,null,null,null,null,null,null,null,null,null,null,null,null,null,null,null,null,null,null,null,null,null,null,null,null,null,null,null,null,null,null,null,null,null,null,null,null,null,null,null,null,null,"5B"]
[null,null,null,null,null,null,null,null,null,null,null,null,null,null,null,null,null,null,null,null,null,null,null,null,null,null,null,null,null,null,null,null,null,null,null,null,null,null,null,null,null,null,null,null,null,null,null,null,null,null,null,null,null,null,null,null,null,null,null,null,null,null,null,null,null,null,null,"5B"]
[null,null,null,null,null,null,null,null,null,null,null,null,null,null,null,null,null,null,null,null,null,null,null,null,null,null,null,null,null,null,null,null,null,null,null,null,null,null,null,null,null,null,null,null,null,null,null,null,null,null,null,null,null,null,null,null,null,null,null,null,null,null,null,null,null,null,null,"5B"]
[null,null,null,null,null,null,null,null,null,null,null,null,null,null,null,null,null,null,null,null,null,null,null,null,null,null,null,null,null,null,null,null,null,null,null,null,null,null,null,null,null,null,null,null,null,null,null,null,null,null,null,null,null,null,null,null,null,null,null,null,null,null,null,null,null,null,null,"5B"]
[null,null,null,null,null,null,null,null,null,null,null,null,null,null,null,null,null,null,null,null,null,null,null,null,null,null,null,null,null,null,null,null,null,null,null,null,null,null,null,null,null,null,null,null,null,null,null,null,null,null,null,null,null,null,null,null,null,null,null,null,null,null,null,null,null,null,null,"6A"]
[null,null,null,null,null,null,null,null,null,null,null,null,null,null,null,null,null,null,null,null,null,null,null,null,null,null,null,null,null,null,null,null,null,null,null,null,null,null,null,null,null,null,null,null,null,null,null,null,null,null,null,null,null,null,null,null,null,null,null,null,null,null,null,null,null,null,null,"6A"]
[null,null,null,null,null,null,null,null,null,null,null,null,null,null,null,null,null,null,null,null,null,null,null,null,null,null,null,null,null,null,null,null,null,null,null,null,null,null,null,null,null,null,null,null,null,null,null,null,null,null,null,null,null,null,null,null,null,null,null,null,null,null,null,null,null,null,null,"6A"]
[null,null,null,null,null,null,null,null,null,null,null,null,null,null,null,null,null,null,null,null,null,null,null,null,null,null,null,null,null,null,null,null,null,null,null,null,null,null,null,null,null,null,null,null,null,null,null,null,null,null,null,null,null,null,null,null,null,null,null,null,null,null,null,null,null,null,null,"6A"]
[null,null,null,null,null,null,null,null,null,null,null,null,null,null,null,null,null,null,null,null,null,null,null,null,null,null,null,null,null,null,null,null,null,null,null,null,null,null,null,null,null,null,null,null,null,null,null,null,null,null,null,null,null,null,null,null,null,null,null,null,null,null,null,null,null,null,null,"6A"]
[null,null,null,null,null,null,null,null,null,null,null,null,null,null,null,null,null,null,null,null,null,null,null,null,null,null,null,null,null,null,null,null,null,null,null,null,null,null,null,null,null,null,null,null,null,null,null,null,null,null,null,null,null,null,null,null,null,null,null,null,null,null,null,null,null,null,null,"6A"]
[null,null,null,null,null,null,null,null,null,null,null,null,null,null,null,null,null,null,null,null,null,null,null,null,null,null,null,null,null,null,null,null,null,null,null,null,null,null,null,null,null,null,null,null,null,null,null,null,null,null,null,null,null,null,null,null,null,null,null,null,null,null,null,null,null,null,null,"6A"]
[null,null,null,null,null,null,null,null,null,null,null,null,null,null,null,null,null,null,null,null,null,null,null,null,null,null,null,null,null,null,null,null,null,null,null,null,null,null,null,null,null,null,null,null,null,null,null,null,null,null,null,null,null,null,null,null,null,null,null,null,null,null,null,null,null,null,null,"6A"]
{"$rows_left_out":110}
{"sheet":"ANASAYFA","index":1,"n_rows":34,"n_cols":33,"rows_kept":34,"cut":false,"hidden":false,"merged":[[0,32,4,40],[0,20,5,24],[2,15,2,19],[3,15,3,19],[4,15,4,19],[5,15,5,19],[1,10,1,13],[2,10,2,13],[3,10,3,13],[4,10,4,13],[5,10,5,13],[0,10,0,14],[0,15,0,19],[1,15,1,19],[38,0,38,5],[39,0,39,5],[31,6,31,28],[27,0,27,5],[26,6,26,28],[28,0,28,5],[27,6,27,28],[29,0,29,5],[28,6,28,28],[21,0,24,5],[17,6,20,28],[25,0,25,5],[26,0,26,5],[40,0,40,5],[3,5,3,9],[21,6,24,28],[33,6,33,28],[3,0,3,3],[33,0,33,5],[32,6,32,28],[34,0,34,5],[35,0,35,5],[36,0,36,5],[37,0,37,5],[30,0,30,5],[29,6,29,28],[31,0,31,5],[30,6,30,28],[32,0,32,5],[25,6,25,28],[8,0,8,28],[9,0,12,5],[13,0,16,5],[9,6,12,28],[17,0,20,5],[13,6,16,28],[6,0,6,28],[7,0,7,4],[7,5,7,6],[7,7,7,11],[7,12,7,13],[7,14,7,18],[7,19,7,20],[7,21,7,25],[7,26,7,28],[0,0,0,3],[0,5,0,9],[4,0,4,3],[4,5,4,9],[5,0,5,3],[5,5,5,9],[2,0,2,3],[2,5,2,9],[1,0,1,3],[1,5,1,9]]}
["OKUL NO",null,null,null,":",605,null,null,null,null,"AİLE SIRA NO",null,null,null,null,{"$f":"IFERROR(VLOOKUP(F1,'VERİ TABANI'!A1:BM293,65,FALSE),\" \")","v":"41"},null,null,null,null,null,null,null,null,null,null,null,null,null,null,null,null,"NOT: BU KISMA SADECE ÖĞRENCİ NUMARASI GİRİŞİ YAPILACAKTIR"]
["SINIFI",null,null,null,":",{"$f":"IFERROR(VLOOKUP(F1,'VERİ TABANI'!A1:D293,4,FALSE),\" \")","v":"5A"},null,null,null,null,"ANNE ADI",null,null,null,":",{"$f":"IFERROR(VLOOKUP(F1,'VERİ TABANI'!A1:BN293,66,FALSE),\" \")","v":"FALAN ANNE"}]
["ADI",null,null,null,":",{"$f":"IFERROR(VLOOKUP(F1,'VERİ TABANI'!A1:B293,2,FALSE),\" \")","v":"FALAN"},null,null,null,null,"BABA ADI",null,null,null,":",{"$f":"IFERROR(VLOOKUP(F1,'VERİ TABANI'!A1:BO293,67,FALSE),\" \")","v":"FİLAN BABA"}]
["SOYADI",null,null,null,":",{"$f":"IFERROR(VLOOKUP(F1,'VERİ TABANI'!A1:C293,3,FALSE),\" \")","v":"FİLAN"},null,null,null,null,"1. DENEME",null,null,null,":"]
["TC KİMLİK",null,null,null,":",{"$f":"IFERROR(VLOOKUP(F1,'VERİ TABANI'!A1:F293,6,FALSE),\" \")","v":10403944634},null,null,null,null,"2. DENEME",null,null,null,":"]
["CİLT NO",null,null,null,":",{"$f":"IFERROR(VLOOKUP(F1,'VERİ TABANI'!A1:G293,7,FALSE),\" \")","v":"147"},null,null,null,null,"3. DENEME",null,null,null,":"]
["ALİ RIZA YILMAZ ORTAOKULU"]
["4. SINIF ORTALAMA",null,null,null,null,{"$f":"IFERROR(VLOOKUP(F1,'VERİ TABANI'!A1:BH293,60,FALSE),\" \")","v":78.090600000000009},null,"5. SINIF ORT.",null,null,null,null,{"$f":"IFERROR(VLOOKUP(F1,'VERİ TABANI'!A1:BI293,61,FALSE),\" \")","v":85},null,"6. SINIF ORT.",null,null,null,null,{"$f":"IFERROR(VLOOKUP(F1,'VERİ TABANI'!A1:BJ293,62,FALSE),\" \")","v":90},null,"7. SINIF ORT.",null,null,null,null,{"$f":"IFERROR(VLOOKUP(F1,'VERİ TABANI'!A1:BK293,63,FALSE),\" \")","v":98}]
["SINIF VE DERS ÖĞRETMENLERİNİN ÖĞRENCİ HAKKINDAKİ GÖRÜŞLERİ"]
["Kişilik",null,null,null,null,null,{"$f":"IFERROR(VLOOKUP(F1,'VERİ TABANI'!A1:I1193,8,FALSE),\" \")","v":"Davranış, terbiye ve saygı bakımından olumlu bir öğrencidir. Güvenilir bir öğrencidir. "}]
[]
[]
[]
["Sağlık ve Beslenme Durumu",null,null,null,null,null,{"$f":"IFERROR(VLOOKUP(F1,'VERİ TABANI'!A1:J913,9,FALSE),\" \")","v":"Herhangi bir sağlık problemi bulunmamaktadır"}]
[]
[]
[]
["Sosyal\nİlişkileri",null,null,null,null,null,{"$f":"IFERROR(VLOOKUP(F1,'VERİ TABANI'!A1:K913,10,FALSE),\" \")","v":"Aktif, dürüst,  güvenilir, iyi huylu, konuşkan birisidir"}]
[]
[]
[]
["Ekonomik\nDurum ",null,null,null,null,null,{"$f":"IFERROR(VLOOKUP(F1,'VERİ TABANI'!A1:L913,11,FALSE),\" \")","v":"ekonomik durumu iyidir"}]
[]
[]
[]
["TÜRKÇE",null,null,null,null,null,{"$f":"IFERROR(VLOOKUP(F1,'VERİ TABANI'!A1:M913,12,FALSE),\" \")","v":"Derste çok istekli ve gayretli bir öğrenci"}]
["MATEMATİK",null,null,null,null,null,{"$f":"IFERROR(VLOOKUP(F1,'VERİ TABANI'!A1:N913,13,FALSE),\" \")","v":"zeki, dikkat dağınıklığı var belirli bir süre odaklanamıyor"}]
["FEN BİLİMLERİ",null,null,null,null,null,{"$f":"IFERROR(VLOOKUP(F1,'VERİ TABANI'!A1:O913,14,FALSE),\" \")","v":"derslere katılımı güzeldir."}]
["SOSYAL BİL.",null,null,null,null,null,{"$f":"IFERROR(VLOOKUP(F1,'VERİ TABANI'!A1:P913,15,FALSE),\" \")","v":"Derse aktif olarak katılmaya çalışıyor istekli fakat bazen sadece cevap vermek için derse katılıyor. "}]
["YABANCI DİL",null,null,null,null,null,{"$f":"IFERROR(VLOOKUP(F1,'VERİ TABANI'!A1:Q913,16,FALSE),\" \")","v":"derse ilgili aktif başarılı"}]
["DİN KÜLTÜRÜ",null,null,null,null,null,{"$f":"IFERROR(VLOOKUP(F1,'VERİ TABANI'!A1:R913,17,FALSE),\" \")","v":"Derse katılımı normaldir. "}]
["BEDEN EĞİTİMİ",null,null,null,null,null,{"$f":"IFERROR(VLOOKUP(F1,'VERİ TABANI'!A1:S913,18,FALSE),\" \")","v":"dersi ve ders dışında hareketli bir öğrencim hareket becerilerinde orta seviye üstü "}]
["TEKNOLOJİ VE T.",null,null,null,null,null,{"$f":"IFERROR(VLOOKUP(F1,'VERİ TABANI'!A1:T913,19,FALSE),\" \")","v":"Harika bir öğrenci. Davranışlarını beğeniyorum"}]
["MÜZİK",null,null,null,null,null,{"$f":"IFERROR(VLOOKUP(F1,'VERİ TABANI'!A1:U913,20,FALSE),\" \")","v":"Rahat, kendine güvenen ,haylazlığa meyilli bir öğrenci .Derslere katılımı çok başarılı değil  ama istekli."}]

{"sheet":"Sayfa1","index":2,"n_rows":149,"n_cols":1,"rows_kept":149,"cut":false,"hidden":false,"merged":[]}
[]
[]
["OKUL N"]
[605]
[609]
[614]
[613]
[615]
[604]
[616]
[601]
[631]
[608]
[606]
[603]
[607]
[600]
[627]
[635]
[629]
[636]
[628]
[633]
[602]
[621]
[624]
[622]
[634]
[638]
[632]
[626]
[630]
[502]
[518]
[510]
[504]
[522]
[507]
[516]
[501]
{"$rows_left_out":109}